java 问题,谁知道怎么解决?

是这样,编译 leveldbjni 报错。
提示是 java.lang.UnsupportedOperationException 。
我怀疑是不支持 mips64el ,但是按说 java 源代码里面不应该有架构相关代码吧?
但是我重新编译了 hawtjni 也没用。
还是说,不是这两个东西的问题,而是别的软件包导致的错误?
[DEBUG]   (f) customPackageDirectory = /builddir/build/BUILD/leveldbjni-leveldbjni-1.8/leveldbjni/src/main/native-package
[DEBUG] (f) encoding = UTF-8
[DEBUG] (f) generatedNativeSourceDirectory = /builddir/build/BUILD/leveldbjni-leveldbjni-1.8/leveldbjni/target/generated-sources/hawtjni/native-src
[DEBUG] (f) name = leveldbjni
[DEBUG] (f) packageDirectory = /builddir/build/BUILD/leveldbjni-leveldbjni-1.8/leveldbjni/target/generated-sources/hawtjni/native-package
[DEBUG] (f) project = MavenProject: org.fusesource.leveldbjni:leveldbjni:1.8 @ /builddir/build/BUILD/leveldbjni-leveldbjni-1.8/leveldbjni/pom.xml
[DEBUG] (f) skipAutogen = false
[DEBUG] (f) windowsBuildTool = detect
[DEBUG] -- end configuration --
[INFO] Analyzing classes...
[INFO]
[INFO] ------------------------------------------------------------------------
[INFO] Skipping leveldbjni-project
[INFO] This project has been banned from the build due to previous failures.
[INFO] ------------------------------------------------------------------------
[INFO] ------------------------------------------------------------------------
[INFO] Reactor Summary:
[INFO]
[INFO] leveldbjni-project ................................. SUCCESS [ 0.026 s]
[INFO] leveldbjni ......................................... FAILURE [ 21.210 s]
[INFO] leveldbjni-linux64 ................................. SKIPPED
[INFO] leveldbjni-all ..................................... SKIPPED
[INFO] ------------------------------------------------------------------------
[INFO] BUILD FAILURE
[INFO] ------------------------------------------------------------------------
[INFO] Total time: 45.423 s
[INFO] Finished at: 2018-08-14T18:21:19+08:00
[INFO] Final Memory: 17M/123M
[INFO] ------------------------------------------------------------------------
[DEBUG] Full XMvn dependency report:
[DEBUG] <gId>:<aId>:<ext>[:<classifier>:]<version> => <compat-version>, provided by <pkg-name> (<rpm-version>)
[DEBUG] org.fusesource:fusesource-pom:pom:1.9 => null, provided by (none)
[DEBUG] org.fusesource:fusesource-pom:pom:1.11 => null, provided by (none)
[DEBUG] org.apache.felix:maven-bundle-plugin:pom:2.3.7 => null, provided by (none)
[DEBUG] net.sf.kxml:kxml2:pom:any => null, provided by (none)
[DEBUG] xpp3:xpp3:pom:any => null, provided by (none)
[DEBUG] org.osgi:osgi.core:pom:4.3.1 => null, provided by (none)
[DEBUG] biz.aQute.bnd:biz.aQute.bndlib:pom:3.5.0 => null, provided by (none)
[DEBUG] biz.aQute.bnd:biz.aQute.bnd.annotation:pom:3.5.0 => null, provided by (none)
[DEBUG] biz.aQute.bnd:aQute.libg:pom:3.5.0 => null, provided by (none)
[DEBUG] org.slf4j:slf4j-api:pom:any => null, provided by (none)
[DEBUG] org.osgi:osgi.cmpn:pom:any => null, provided by (none)
[DEBUG] org.osgi:osgi.core:pom:any => null, provided by (none)
[DEBUG] org.osgi:osgi.annotation:pom:any => null, provided by (none)
[DEBUG] org.apache.felix:org.apache.felix.bundlerepository:pom:1.6.6 => null, provided by (none)
[DEBUG] org.apache.felix:org.apache.felix.utils:pom:1.8.0 => null, provided by (none)
[DEBUG] org.apache.felix:org.apache.felix.utils:pom:1.6.0 => null, provided by (none)
[DEBUG] org.apache.maven:maven-core:pom:3.3.9 => null, provided by (none)
[DEBUG] org.apache.maven:maven-model:pom:3.5.2 => null, provided by (none)
[DEBUG] org.codehaus.plexus:plexus-utils:pom:3.1.0 => null, provided by (none)
[DEBUG] org.apache.commons:commons-lang3:pom:3.5 => null, provided by (none)
[DEBUG] org.apache.maven:maven-settings:pom:3.5.2 => null, provided by (none)
[DEBUG] org.apache.maven:maven-settings-builder:pom:3.5.2 => null, provided by (none)
[DEBUG] org.apache.maven:maven-builder-support:pom:3.5.2 => null, provided by (none)
[DEBUG] org.codehaus.plexus:plexus-interpolation:pom:1.24 => null, provided by (none)
[DEBUG] org.codehaus.plexus:plexus-component-annotations:pom:1.7.1 => null, provided by (none)
[DEBUG] org.sonatype.plexus:plexus-sec-dispatcher:pom:1.4 => null, provided by (none)
[DEBUG] org.codehaus.plexus:plexus-utils:pom:2.0.5 => null, provided by (none)
[DEBUG] org.sonatype.plexus:plexus-cipher:pom:1.4 => null, provided by (none)
[DEBUG] org.apache.maven:maven-repository-metadata:pom:3.5.2 => null, provided by (none)
[DEBUG] org.apache.maven:maven-artifact:pom:3.5.2 => null, provided by (none)
[DEBUG] org.apache.maven:maven-plugin-api:pom:3.5.2 => null, provided by (none)
[DEBUG] org.eclipse.sisu:org.eclipse.sisu.plexus:pom:0.3.3 => null, provided by (none)
[DEBUG] org.eclipse.sisu:org.eclipse.sisu.inject:pom:0.3.3 => null, provided by (none)
[DEBUG] javax.enterprise:cdi-api:pom:1.1 => null, provided by (none)
[DEBUG] javax.el:javax.el-api:pom:3.0.0 => null, provided by (none)
[DEBUG] org.jboss.spec.javax.interceptor:jboss-interceptors-api_1.2_spec:pom:any => null, provided by (none)
[DEBUG] javax.inject:javax.inject:pom:1 => null, provided by (none)
[DEBUG] org.codehaus.plexus:plexus-classworlds:pom:2.5.2 => null, provided by (none)
[DEBUG] org.codehaus.plexus:plexus-component-annotations:pom:1.6 => null, provided by (none)
[DEBUG] org.codehaus.plexus:plexus-utils:pom:3.0.22 => null, provided by (none)
[DEBUG] org.apache.maven:maven-model-builder:pom:3.5.2 => null, provided by (none)
[DEBUG] com.google.guava:guava:pom:20.0 => 20.0, provided by (none)
[DEBUG] org.apache.maven:maven-resolver-provider:pom:3.5.2 => null, provided by (none)
[DEBUG] org.apache.maven.resolver:maven-resolver-api:pom:1.1.0 => null, provided by (none)
[DEBUG] org.apache.maven.resolver:maven-resolver-spi:pom:1.1.0 => null, provided by (none)
[DEBUG] org.apache.maven.resolver:maven-resolver-util:pom:1.1.0 => null, provided by (none)
[DEBUG] org.apache.maven.resolver:maven-resolver-impl:pom:1.1.0 => null, provided by (none)
[DEBUG] org.apache.maven.shared:maven-shared-utils:pom:3.1.0 => null, provided by (none)
[DEBUG] commons-io:commons-io:pom:2.5 => null, provided by (none)
[DEBUG] com.google.inject:guice:pom:4.0 => null, provided by (none)
[DEBUG] aopalliance:aopalliance:pom:1.0 => null, provided by (none)
[DEBUG] com.google.guava:guava:pom:19.0 => 19.0, provided by (none)
[DEBUG] org.apache.maven:maven-compat:pom:3.3.9 => null, provided by (none)
[DEBUG] org.apache.maven:maven-core:pom:3.5.2 => null, provided by (none)
[DEBUG] org.apache.maven.wagon:wagon-provider-api:pom:2.12 => null, provided by (none)
[DEBUG] org.codehaus.plexus:plexus-utils:pom:3.0.24 => null, provided by (none)
[DEBUG] org.apache.maven.reporting:maven-reporting-impl:pom:2.4 => null, provided by (none)
[DEBUG] org.apache.maven.reporting:maven-reporting-api:pom:3.0 => null, provided by (none)
[DEBUG] org.apache.maven.doxia:doxia-sink-api:pom:1.0 => null, provided by (none)
[DEBUG] org.apache.maven.doxia:doxia-logging-api:pom:1.7 => null, provided by (none)
[DEBUG] org.codehaus.plexus:plexus-container-default:pom:1.5.5 => null, provided by (none)
[DEBUG] org.ow2.asm:asm-commons:pom:5.0.3 => null, provided by (none)
[DEBUG] org.ow2.asm:asm:pom:6.1.1 => null, provided by (none)
[DEBUG] org.ow2.asm:asm-tree:pom:6.1.1 => null, provided by (none)
[DEBUG] org.ow2.asm:asm-analysis:pom:6.1.1 => null, provided by (none)
[DEBUG] org.ow2.asm:asm:pom:5.0.3 => null, provided by (none)
[DEBUG] org.codehaus.plexus:plexus-utils:pom:3.0.20 => null, provided by (none)
[DEBUG] org.codehaus.plexus:plexus-classworlds:pom:2.5.1 => null, provided by (none)
[DEBUG] org.apache.xbean:xbean-reflect:pom:3.7 => null, provided by (none)
[DEBUG] org.apache.maven:maven-core:pom:3.0 => null, provided by (none)
[DEBUG] org.apache.maven:maven-plugin-api:pom:3.0 => null, provided by (none)
[DEBUG] org.apache.maven.shared:maven-shared-utils:pom:3.2.0 => null, provided by (none)
[DEBUG] org.apache.maven.doxia:doxia-sink-api:pom:1.7 => null, provided by (none)
[DEBUG] org.apache.maven.doxia:doxia-decoration-model:pom:1.7.4 => null, provided by (none)
[DEBUG] org.codehaus.plexus:plexus-component-annotations:pom:1.5.5 => null, provided by (none)
[DEBUG] org.apache.maven.doxia:doxia-core:pom:1.7 => null, provided by (none)
[DEBUG] commons-lang:commons-lang:pom:2.4 => null, provided by (none)
[DEBUG] org.apache.httpcomponents:httpclient:pom:4.0.2 => null, provided by (none)
[DEBUG] org.apache.httpcomponents:httpcore:pom:4.4.9 => null, provided by (none)
[DEBUG] commons-logging:commons-logging:pom:1.2 => null, provided by (none)
[DEBUG] commons-codec:commons-codec:pom:1.10 => null, provided by (none)
[DEBUG] org.apache.httpcomponents:httpcore:pom:4.0.1 => null, provided by (none)
[DEBUG] xmlunit:xmlunit:pom:1.5 => null, provided by (none)
[DEBUG] org.apache.maven.doxia:doxia-site-renderer:pom:1.7.4 => null, provided by (none)
[DEBUG] org.apache.maven:maven-artifact:pom:3.0 => null, provided by (none)
[DEBUG] org.apache.maven.doxia:doxia-decoration-model:pom:1.7.5 => null, provided by (none)
[DEBUG] org.apache.maven.doxia:doxia-skin-model:pom:1.7.5 => null, provided by (none)
[DEBUG] org.apache.maven.doxia:doxia-module-xhtml:pom:1.7 => null, provided by (none)
[DEBUG] org.codehaus.plexus:plexus-i18n:pom:1.0-beta-7 => null, provided by (none)
[DEBUG] org.codehaus.plexus:plexus-utils:pom:1.4.5 => null, provided by (none)
[DEBUG] org.codehaus.plexus:plexus-container-default:pom:1.0-alpha-9-stable-1 => null, provided by (none)
[DEBUG] org.codehaus.plexus:plexus-container-default:pom:1.0-alpha-30 => null, provided by (none)
[DEBUG] org.codehaus.plexus:plexus-velocity:pom:1.2 => null, provided by (none)
[DEBUG] commons-collections:commons-collections:pom:3.1 => null, provided by (none)
[DEBUG] org.apache.velocity:velocity:pom:1.7 => null, provided by (none)
[DEBUG] commons-collections:commons-collections:pom:3.2.1 => null, provided by (none)
[DEBUG] org.apache.maven:maven-archiver:pom:2.6 => null, provided by (none)
[DEBUG] org.apache.maven:maven-model:pom:3.0 => null, provided by (none)
[DEBUG] org.codehaus.plexus:plexus-archiver:pom:3.5 => null, provided by (none)
[DEBUG] org.codehaus.plexus:plexus-io:pom:3.0.0 => null, provided by (none)
[DEBUG] org.apache.commons:commons-compress:pom:1.14 => null, provided by (none)
[DEBUG] org.objenesis:objenesis:pom:2.6 => null, provided by (none)
[DEBUG] org.iq80.snappy:snappy:pom:0.4 => null, provided by (none)
[DEBUG] org.tukaani:xz:pom:1.6 => null, provided by (none)
[DEBUG] org.codehaus.plexus:plexus-interpolation:pom:1.22 => null, provided by (none)
[DEBUG] org.apache.maven.shared:maven-dependency-tree:pom:3.0 => null, provided by (none)
[DEBUG] org.eclipse.aether:aether-util:pom:0.9.0.M2 => null, provided by (none)
[DEBUG] org.sonatype.plexus:plexus-build-api:pom:0.0.7 => null, provided by (none)
[DEBUG] org.codehaus.plexus:plexus-utils:pom:1.5.8 => null, provided by (none)
[DEBUG] org.apache.maven.doxia:doxia-site-renderer:pom:1.0 => null, provided by (none)
[DEBUG] org.apache.felix:maven-bundle-plugin:jar:2.3.7 => null, provided by (none)
[DEBUG] net.sf.kxml:kxml2:jar:any => null, provided by (none)
[DEBUG] xpp3:xpp3:jar:any => null, provided by (none)
[DEBUG] org.osgi:osgi.core:jar:4.3.1 => null, provided by (none)
[DEBUG] biz.aQute.bnd:biz.aQute.bndlib:jar:3.5.0 => null, provided by (none)
[DEBUG] biz.aQute.bnd:biz.aQute.bnd.annotation:jar:3.5.0 => null, provided by (none)
[DEBUG] biz.aQute.bnd:aQute.libg:jar:3.5.0 => null, provided by (none)
[DEBUG] org.slf4j:slf4j-api:jar:any => null, provided by (none)
[DEBUG] org.osgi:osgi.cmpn:jar:any => null, provided by (none)
[DEBUG] org.osgi:osgi.annotation:jar:any => null, provided by (none)
[DEBUG] org.apache.felix:org.apache.felix.bundlerepository:jar:1.6.6 => null, provided by (none)
[DEBUG] org.apache.felix:org.apache.felix.utils:jar:1.6.0 => null, provided by (none)
[DEBUG] org.apache.maven:maven-core:jar:3.3.9 => null, provided by (none)
[DEBUG] org.apache.maven:maven-model:jar:3.5.2 => null, provided by (none)
[DEBUG] org.apache.maven:maven-settings:jar:3.5.2 => null, provided by (none)
[DEBUG] org.apache.maven:maven-settings-builder:jar:3.5.2 => null, provided by (none)
[DEBUG] org.sonatype.plexus:plexus-sec-dispatcher:jar:1.4 => null, provided by (none)
[DEBUG] org.sonatype.plexus:plexus-cipher:jar:1.4 => null, provided by (none)
[DEBUG] org.apache.maven:maven-builder-support:jar:3.5.2 => null, provided by (none)
[DEBUG] org.apache.maven:maven-repository-metadata:jar:3.5.2 => null, provided by (none)
[DEBUG] org.apache.maven:maven-artifact:jar:3.5.2 => null, provided by (none)
[DEBUG] org.apache.maven:maven-plugin-api:jar:3.5.2 => null, provided by (none)
[DEBUG] org.apache.maven:maven-model-builder:jar:3.5.2 => null, provided by (none)
[DEBUG] org.apache.maven:maven-resolver-provider:jar:3.5.2 => null, provided by (none)
[DEBUG] org.apache.maven.resolver:maven-resolver-impl:jar:1.1.0 => null, provided by (none)
[DEBUG] org.apache.maven.resolver:maven-resolver-api:jar:1.1.0 => null, provided by (none)
[DEBUG] org.apache.maven.resolver:maven-resolver-spi:jar:1.1.0 => null, provided by (none)
[DEBUG] org.apache.maven.resolver:maven-resolver-util:jar:1.1.0 => null, provided by (none)
[DEBUG] org.apache.maven.shared:maven-shared-utils:jar:3.1.0 => null, provided by (none)
[DEBUG] org.eclipse.sisu:org.eclipse.sisu.plexus:jar:0.3.3 => null, provided by (none)
[DEBUG] org.eclipse.sisu:org.eclipse.sisu.inject:jar:0.3.3 => null, provided by (none)
[DEBUG] javax.enterprise:cdi-api:jar:1.1 => null, provided by (none)
[DEBUG] javax.el:javax.el-api:jar:3.0.0 => null, provided by (none)
[DEBUG] org.jboss.spec.javax.interceptor:jboss-interceptors-api_1.2_spec:jar:any => null, provided by (none)
[DEBUG] com.google.inject:guice:jar:no_aop:4.0 => null, provided by (none)
[DEBUG] aopalliance:aopalliance:jar:1.0 => null, provided by (none)
[DEBUG] com.google.guava:guava:jar:20.0 => 20.0, provided by (none)
[DEBUG] javax.inject:javax.inject:jar:1 => null, provided by (none)
[DEBUG] org.codehaus.plexus:plexus-classworlds:jar:2.5.2 => null, provided by (none)
[DEBUG] org.codehaus.plexus:plexus-component-annotations:jar:1.7.1 => null, provided by (none)
[DEBUG] org.apache.commons:commons-lang3:jar:3.5 => null, provided by (none)
[DEBUG] org.apache.maven:maven-compat:jar:3.3.9 => null, provided by (none)
[DEBUG] org.codehaus.plexus:plexus-interpolation:jar:1.24 => null, provided by (none)
[DEBUG] org.apache.maven.wagon:wagon-provider-api:jar:2.12 => null, provided by (none)
[DEBUG] org.apache.maven.reporting:maven-reporting-impl:jar:2.4 => null, provided by (none)
[DEBUG] org.apache.maven.reporting:maven-reporting-api:jar:3.0 => null, provided by (none)
[DEBUG] org.apache.maven.doxia:doxia-decoration-model:jar:1.7.4 => null, provided by (none)
[DEBUG] org.apache.maven.doxia:doxia-core:jar:1.7 => null, provided by (none)
[DEBUG] commons-lang:commons-lang:jar:2.4 => null, provided by (none)
[DEBUG] org.apache.httpcomponents:httpclient:jar:4.0.2 => null, provided by (none)
[DEBUG] commons-logging:commons-logging:jar:1.2 => null, provided by (none)
[DEBUG] commons-codec:commons-codec:jar:1.10 => null, provided by (none)
[DEBUG] org.apache.httpcomponents:httpcore:jar:4.0.1 => null, provided by (none)
[DEBUG] xmlunit:xmlunit:jar:1.5 => null, provided by (none)
[DEBUG] org.apache.maven:maven-archiver:jar:2.6 => null, provided by (none)
[DEBUG] commons-io:commons-io:jar:2.5 => null, provided by (none)
[DEBUG] org.codehaus.plexus:plexus-archiver:jar:3.5 => null, provided by (none)
[DEBUG] org.codehaus.plexus:plexus-io:jar:3.0.0 => null, provided by (none)
[DEBUG] org.apache.commons:commons-compress:jar:1.14 => null, provided by (none)
[DEBUG] org.objenesis:objenesis:jar:2.6 => null, provided by (none)
[DEBUG] org.iq80.snappy:snappy:jar:0.4 => null, provided by (none)
[DEBUG] org.tukaani:xz:jar:1.6 => null, provided by (none)
[DEBUG] org.apache.maven.shared:maven-dependency-tree:jar:3.0 => null, provided by (none)
[DEBUG] org.eclipse.aether:aether-util:jar:0.9.0.M2 => null, provided by (none)
[DEBUG] org.codehaus.plexus:plexus-utils:jar:3.0.24 => null, provided by (none)
[DEBUG] org.sonatype.plexus:plexus-build-api:jar:0.0.7 => null, provided by (none)
[DEBUG] org.apache.maven.doxia:doxia-sink-api:jar:1.0 => null, provided by (none)
[DEBUG] org.apache.maven.doxia:doxia-logging-api:jar:1.7 => null, provided by (none)
[DEBUG] org.apache.maven.doxia:doxia-site-renderer:jar:1.0 => null, provided by (none)
[DEBUG] org.apache.maven.doxia:doxia-skin-model:jar:1.7.5 => null, provided by (none)
[DEBUG] org.apache.maven.doxia:doxia-module-xhtml:jar:1.7 => null, provided by (none)
[DEBUG] org.codehaus.plexus:plexus-i18n:jar:1.0-beta-7 => null, provided by (none)
[DEBUG] org.codehaus.plexus:plexus-container-default:jar:1.0-alpha-30 => null, provided by (none)
[DEBUG] org.ow2.asm:asm-commons:jar:5.0.3 => null, provided by (none)
[DEBUG] org.ow2.asm:asm-tree:jar:6.1.1 => null, provided by (none)
[DEBUG] org.ow2.asm:asm-analysis:jar:6.1.1 => null, provided by (none)
[DEBUG] org.ow2.asm:asm:jar:5.0.3 => null, provided by (none)
[DEBUG] org.apache.xbean:xbean-reflect:jar:3.7 => null, provided by (none)
[DEBUG] org.codehaus.plexus:plexus-velocity:jar:1.2 => null, provided by (none)
[DEBUG] org.apache.velocity:velocity:jar:1.7 => null, provided by (none)
[DEBUG] commons-collections:commons-collections:jar:3.2.1 => null, provided by (none)
[DEBUG] org.fedoraproject.xmvn:xmvn-mojo:jar:SYSTEM => SYSTEM, provided by (none)
[DEBUG] org.fedoraproject.xmvn:xmvn-mojo:pom:SYSTEM => SYSTEM, provided by (none)
[DEBUG] org.apache.maven.plugins:maven-javadoc-plugin:pom:2.5 => null, provided by (none)
[DEBUG] org.apache.maven.plugins:maven-javadoc-plugin:jar:2.5 => null, provided by (none)
[DEBUG] org.fusesource.hawtjni:maven-hawtjni-plugin:pom:1.9 => null, provided by (none)
[DEBUG] org.fusesource.hawtjni:maven-hawtjni-plugin:jar:1.9 => null, provided by (none)
[DEBUG] org.apache.maven.plugins:maven-resources-plugin:pom:2.5 => null, provided by (none)
[DEBUG] org.apache.maven.plugins:maven-resources-plugin:jar:2.5 => null, provided by (none)
[DEBUG] org.apache.maven.plugins:maven-compiler-plugin:pom:2.3.2 => null, provided by (none)
[DEBUG] org.apache.maven.plugins:maven-compiler-plugin:jar:2.3.2 => null, provided by (none)
[DEBUG] org.apache.felix:maven-bundle-plugin:pom:2.0.1 => null, provided by (none)
[DEBUG] org.apache.felix:maven-bundle-plugin:jar:2.0.1 => null, provided by (none)
[DEBUG] org.apache.maven.plugins:maven-surefire-plugin:pom:2.4.3 => null, provided by (none)
[DEBUG] org.apache.maven.plugins:maven-surefire-plugin:jar:2.4.3 => null, provided by (none)
[DEBUG] org.apache.maven.plugins:maven-jar-plugin:pom:3.0.2 => null, provided by (none)
[DEBUG] org.apache.maven.plugins:maven-jar-plugin:jar:3.0.2 => null, provided by (none)
[DEBUG] org.apache.maven.plugins:maven-source-plugin:pom:2.2.1 => null, provided by (none)
[DEBUG] org.apache.maven.plugins:maven-source-plugin:jar:2.2.1 => null, provided by (none)
[DEBUG] org.fusesource.hawtjni:hawtjni-runtime:pom:1.9 => null, provided by (none)
[DEBUG] org.iq80.leveldb:leveldb-api:pom:0.6 => null, provided by (none)
[DEBUG] junit:junit:pom:4.7 => null, provided by (none)
[DEBUG] org.hamcrest:hamcrest-core:pom:1.3 => null, provided by (none)
[DEBUG] org.fusesource.hawtjni:hawtjni-runtime:jar:1.9 => null, provided by (none)
[DEBUG] org.iq80.leveldb:leveldb-api:jar:0.6 => null, provided by (none)
[DEBUG] junit:junit:jar:4.7 => null, provided by (none)
[DEBUG] org.hamcrest:hamcrest-core:jar:1.3 => null, provided by (none)
[DEBUG] org.apache.maven.shared:maven-filtering:pom:3.1.1 => null, provided by (none)
[DEBUG] org.apache.maven.shared:maven-shared-utils:pom:3.0.0 => null, provided by (none)
[DEBUG] org.apache.maven:maven-plugin-api:jar:3.0 => null, provided by (none)
[DEBUG] org.apache.maven:maven-core:jar:3.0 => null, provided by (none)
[DEBUG] org.apache.maven:maven-model:jar:3.0 => null, provided by (none)
[DEBUG] org.apache.maven.shared:maven-filtering:jar:3.1.1 => null, provided by (none)
[DEBUG] org.apache.maven.shared:maven-shared-incremental:pom:1.1 => null, provided by (none)
[DEBUG] org.apache.maven:maven-plugin-api:pom:2.2.1 => null, provided by (none)
[DEBUG] org.apache.maven:maven-core:pom:2.2.1 => null, provided by (none)
[DEBUG] org.apache.maven.shared:maven-shared-utils:pom:0.1 => null, provided by (none)
[DEBUG] org.codehaus.plexus:plexus-java:pom:0.9.2 => null, provided by (none)
[DEBUG] org.ow2.asm:asm:pom:6.0_BETA => null, provided by (none)
[DEBUG] com.thoughtworks.qdox:qdox:pom:2.0-M7 => null, provided by (none)
[DEBUG] org.codehaus.plexus:plexus-compiler-api:pom:2.8.2 => null, provided by (none)
[DEBUG] org.codehaus.plexus:plexus-utils:pom:3.0.8 => null, provided by (none)
[DEBUG] org.codehaus.plexus:plexus-compiler-manager:pom:2.8.2 => null, provided by (none)
[DEBUG] org.codehaus.plexus:plexus-compiler-javac:pom:2.8.2 => null, provided by (none)
[DEBUG] org.codehaus.plexus:plexus-utils:jar:3.1.0 => null, provided by (none)
[DEBUG] org.apache.maven:maven-artifact:jar:3.0 => null, provided by (none)
[DEBUG] org.apache.maven.shared:maven-shared-incremental:jar:1.1 => null, provided by (none)
[DEBUG] org.codehaus.plexus:plexus-java:jar:0.9.2 => null, provided by (none)
[DEBUG] org.ow2.asm:asm:jar:6.0_BETA => null, provided by (none)
[DEBUG] com.thoughtworks.qdox:qdox:jar:2.0-M7 => null, provided by (none)
[DEBUG] org.codehaus.plexus:plexus-compiler-api:jar:2.8.2 => null, provided by (none)
[DEBUG] org.codehaus.plexus:plexus-compiler-manager:jar:2.8.2 => null, provided by (none)
[DEBUG] org.codehaus.plexus:plexus-compiler-javac:jar:2.8.2 => null, provided by (none)
[DEBUG] org.fusesource.hawtjni:hawtjni-generator:pom:1.16 => null, provided by (none)
[DEBUG] org.fusesource.hawtjni:hawtjni-runtime:pom:1.16 => null, provided by (none)
[DEBUG] org.apache.xbean:xbean-finder:pom:4.2 => null, provided by (none)
[DEBUG] org.apache.xbean:xbean-bundleutils:pom:4.5 => null, provided by (none)
[DEBUG] org.slf4j:slf4j-api:pom:1.5.11 => null, provided by (none)
[DEBUG] org.apache.xbean:xbean-asm-util:pom:4.5 => null, provided by (none)
[DEBUG] org.ow2.asm:asm:pom:5.0.4 => null, provided by (none)
[DEBUG] org.ow2.asm:asm-commons:pom:5.0.4 => null, provided by (none)
[DEBUG] commons-cli:commons-cli:pom:1.0 => null, provided by (none)
[DEBUG] org.apache.maven:maven-plugin-api:pom:2.0.6 => null, provided by (none)
[DEBUG] org.apache.maven:maven-project:pom:2.0.6 => null, provided by (none)
[DEBUG] org.apache.maven:maven-settings:pom:2.2.1 => 2.2.1, provided by (none)
[DEBUG] org.apache.maven:maven-model:pom:2.2.1 => 2.2.1, provided by (none)
[DEBUG] org.codehaus.plexus:plexus-utils:pom:1.5.15 => null, provided by (none)
[DEBUG] org.codehaus.plexus:plexus-interpolation:pom:1.11 => null, provided by (none)
[DEBUG] org.apache.maven:maven-profile:pom:2.2.1 => null, provided by (none)
[DEBUG] org.apache.maven:maven-artifact-manager:pom:2.2.1 => null, provided by (none)
[DEBUG] org.apache.maven:maven-repository-metadata:pom:2.2.1 => null, provided by (none)
[DEBUG] org.apache.maven:maven-artifact:pom:2.2.1 => 2.2.1, provided by (none)
[DEBUG] org.apache.maven:maven-plugin-registry:pom:2.2.1 => null, provided by (none)
[DEBUG] org.codehaus.plexus:plexus-interpolation:pom:1.12 => null, provided by (none)
[DEBUG] org.apache.maven:maven-artifact-manager:pom:2.0 => null, provided by (none)
[DEBUG] org.apache.maven:maven-artifact:pom:2.0 => null, provided by (none)
[DEBUG] org.apache.maven:maven-archiver:pom:2.4 => null, provided by (none)
[DEBUG] org.codehaus.plexus:plexus-archiver:pom:1.0-alpha-9 => null, provided by (none)
[DEBUG] org.codehaus.plexus:plexus-io:pom:1.0-alpha-1 => null, provided by (none)
[DEBUG] org.fusesource.hawtjni:hawtjni-generator:jar:1.16 => null, provided by (none)
[DEBUG] org.fusesource.hawtjni:hawtjni-runtime:jar:1.16 => null, provided by (none)
[DEBUG] org.apache.xbean:xbean-finder:jar:4.2 => null, provided by (none)
[DEBUG] org.apache.xbean:xbean-bundleutils:jar:4.5 => null, provided by (none)
[DEBUG] org.slf4j:slf4j-api:jar:1.5.11 => null, provided by (none)
[DEBUG] org.apache.xbean:xbean-asm-util:jar:4.5 => null, provided by (none)
[DEBUG] commons-cli:commons-cli:jar:1.0 => null, provided by (none)
[DEBUG] org.apache.maven:maven-plugin-api:jar:2.0.6 => null, provided by (none)
[DEBUG] org.codehaus.plexus:plexus-component-annotations:jar:1.6 => null, provided by (none)
[DEBUG] org.apache.maven:maven-project:jar:2.0.6 => null, provided by (none)
[DEBUG] org.apache.maven:maven-settings:jar:2.2.1 => 2.2.1, provided by (none)
[DEBUG] org.apache.maven:maven-profile:jar:2.2.1 => null, provided by (none)
[DEBUG] org.apache.maven:maven-plugin-registry:jar:2.2.1 => null, provided by (none)
[DEBUG] org.codehaus.plexus:plexus-container-default:jar:1.0-alpha-9-stable-1 => null, provided by (none)
[DEBUG] org.codehaus.plexus:plexus-utils:jar:1.5.15 => null, provided by (none)
[DEBUG] org.codehaus.plexus:plexus-interpolation:jar:1.12 => null, provided by (none)
[DEBUG] org.apache.maven:maven-artifact-manager:jar:2.0 => null, provided by (none)
[DEBUG] org.apache.maven:maven-repository-metadata:jar:2.2.1 => null, provided by (none)
[DEBUG] org.apache.maven:maven-artifact:jar:2.0 => null, provided by (none)
[DEBUG] org.apache.maven:maven-archiver:jar:2.4 => null, provided by (none)
[DEBUG] org.apache.maven.shared:maven-shared-utils:jar:3.2.0 => null, provided by (none)
[DEBUG] org.codehaus.plexus:plexus-archiver:jar:1.0-alpha-9 => null, provided by (none)
[DEBUG] org.codehaus.plexus:plexus-io:jar:1.0-alpha-1 => null, provided by (none)
[DEBUG] Simplified XMvn dependency report:
[DEBUG] <pkg-name> (<rpm-version>): <requested-versions>
[DEBUG] (none): 0.0.7, 0.1, 0.3.3, 0.4, 0.6, 0.9.0.M2, 0.9.2, 1, 1.0, 1.0-alpha-1, 1.0-alpha-30, 1.0-alpha-9, 1.0-alpha-9-stable-1, 1.0-beta-7, 1.1, 1.1.0, 1.10, 1.11, 1.12, 1.14, 1.16, 1.2, 1.22, 1.24, 1.3, 1.4, 1.4.5, 1.5, 1.5.11, 1.5.15, 1.5.5, 1.5.8, 1.6, 1.6.0, 1.6.6, 1.7, 1.7.1, 1.7.4, 1.7.5, 1.8.0, 1.9, 19.0, 2.0, 2.0-M7, 2.0.1, 2.0.5, 2.0.6, 2.12, 2.2.1, 2.3.2, 2.3.7, 2.4, 2.4.3, 2.5, 2.5.1, 2.5.2, 2.6, 2.8.2, 20.0, 3.0, 3.0.0, 3.0.2, 3.0.20, 3.0.22, 3.0.24, 3.0.8, 3.1, 3.1.0, 3.1.1, 3.2.0, 3.2.1, 3.3.9, 3.5, 3.5.0, 3.5.2, 3.7, 4.0, 4.0.1, 4.0.2, 4.2, 4.3.1, 4.4.9, 4.5, 4.7, 5.0.3, 5.0.4, 6.0_BETA, 6.1.1, SYSTEM, any
[ERROR] Failed to execute goal org.fusesource.hawtjni:hawtjni-maven-plugin:1.16:generate (default) on project leveldbjni: Native source code generation failed: java.lang.RuntimeException: java.lang.UnsupportedOperationException -> [Help 1]
org.apache.maven.lifecycle.LifecycleExecutionException: Failed to execute goal org.fusesource.hawtjni:hawtjni-maven-plugin:1.16:generate (default) on project leveldbjni: Native source code generation failed: java.lang.RuntimeException: java.lang.UnsupportedOperationException
at org.apache.maven.lifecycle.internal.MojoExecutor.execute (MojoExecutor.java:213)
at org.apache.maven.lifecycle.internal.MojoExecutor.execute (MojoExecutor.java:154)
at org.apache.maven.lifecycle.internal.MojoExecutor.execute (MojoExecutor.java:146)
at org.apache.maven.lifecycle.internal.LifecycleModuleBuilder.buildProject (LifecycleModuleBuilder.java:117)
at org.apache.maven.lifecycle.internal.LifecycleModuleBuilder.buildProject (LifecycleModuleBuilder.java:81)
at org.apache.maven.lifecycle.internal.builder.singlethreaded.SingleThreadedBuilder.build (SingleThreadedBuilder.java:51)
at org.apache.maven.lifecycle.internal.LifecycleStarter.execute (LifecycleStarter.java:128)
at org.apache.maven.DefaultMaven.doExecute (DefaultMaven.java:309)
at org.apache.maven.DefaultMaven.doExecute (DefaultMaven.java:194)
at org.apache.maven.DefaultMaven.execute (DefaultMaven.java:107)
at org.apache.maven.cli.MavenCli.execute (MavenCli.java:955)
at org.apache.maven.cli.MavenCli.doMain (MavenCli.java:290)
at org.apache.maven.cli.MavenCli.main (MavenCli.java:194)
at sun.reflect.NativeMethodAccessorImpl.invoke0 (Native Method)
at sun.reflect.NativeMethodAccessorImpl.invoke (NativeMethodAccessorImpl.java:62)
at sun.reflect.DelegatingMethodAccessorImpl.invoke (DelegatingMethodAccessorImpl.java:43)
at java.lang.reflect.Method.invoke (Method.java:498)
at org.codehaus.plexus.classworlds.launcher.Launcher.launchEnhanced (Launcher.java:289)
at org.codehaus.plexus.classworlds.launcher.Launcher.launch (Launcher.java:229)
at org.codehaus.plexus.classworlds.launcher.Launcher.mainWithExitCode (Launcher.java:415)
at org.codehaus.plexus.classworlds.launcher.Launcher.main (Launcher.java:356)
Caused by: org.apache.maven.plugin.MojoExecutionException: Native source code generation failed: java.lang.RuntimeException: java.lang.UnsupportedOperationException
at org.fusesource.hawtjni.maven.GenerateMojo.generateNativeSourceFiles (GenerateMojo.java:207)
at org.fusesource.hawtjni.maven.GenerateMojo.execute (GenerateMojo.java:172)
at org.apache.maven.plugin.DefaultBuildPluginManager.executeMojo (DefaultBuildPluginManager.java:134)
at org.apache.maven.lifecycle.internal.MojoExecutor.execute (MojoExecutor.java:208)
at org.apache.maven.lifecycle.internal.MojoExecutor.execute (MojoExecutor.java:154)
at org.apache.maven.lifecycle.internal.MojoExecutor.execute (MojoExecutor.java:146)
at org.apache.maven.lifecycle.internal.LifecycleModuleBuilder.buildProject (LifecycleModuleBuilder.java:117)
at org.apache.maven.lifecycle.internal.LifecycleModuleBuilder.buildProject (LifecycleModuleBuilder.java:81)
at org.apache.maven.lifecycle.internal.builder.singlethreaded.SingleThreadedBuilder.build (SingleThreadedBuilder.java:51)
at org.apache.maven.lifecycle.internal.LifecycleStarter.execute (LifecycleStarter.java:128)
at org.apache.maven.DefaultMaven.doExecute (DefaultMaven.java:309)
at org.apache.maven.DefaultMaven.doExecute (DefaultMaven.java:194)
at org.apache.maven.DefaultMaven.execute (DefaultMaven.java:107)
at org.apache.maven.cli.MavenCli.execute (MavenCli.java:955)
at org.apache.maven.cli.MavenCli.doMain (MavenCli.java:290)
at org.apache.maven.cli.MavenCli.main (MavenCli.java:194)
at sun.reflect.NativeMethodAccessorImpl.invoke0 (Native Method)
at sun.reflect.NativeMethodAccessorImpl.invoke (NativeMethodAccessorImpl.java:62)
at sun.reflect.DelegatingMethodAccessorImpl.invoke (DelegatingMethodAccessorImpl.java:43)
at java.lang.reflect.Method.invoke (Method.java:498)
at org.codehaus.plexus.classworlds.launcher.Launcher.launchEnhanced (Launcher.java:289)
at org.codehaus.plexus.classworlds.launcher.Launcher.launch (Launcher.java:229)
at org.codehaus.plexus.classworlds.launcher.Launcher.mainWithExitCode (Launcher.java:415)
at org.codehaus.plexus.classworlds.launcher.Launcher.main (Launcher.java:356)
Caused by: java.lang.RuntimeException: java.lang.UnsupportedOperationException
at org.fusesource.hawtjni.generator.HawtJNI.findClasses (HawtJNI.java:299)
at org.fusesource.hawtjni.generator.HawtJNI.generate (HawtJNI.java:211)
at org.fusesource.hawtjni.maven.GenerateMojo.generateNativeSourceFiles (GenerateMojo.java:205)
at org.fusesource.hawtjni.maven.GenerateMojo.execute (GenerateMojo.java:172)
at org.apache.maven.plugin.DefaultBuildPluginManager.executeMojo (DefaultBuildPluginManager.java:134)
at org.apache.maven.lifecycle.internal.MojoExecutor.execute (MojoExecutor.java:208)
at org.apache.maven.lifecycle.internal.MojoExecutor.execute (MojoExecutor.java:154)
at org.apache.maven.lifecycle.internal.MojoExecutor.execute (MojoExecutor.java:146)
at org.apache.maven.lifecycle.internal.LifecycleModuleBuilder.buildProject (LifecycleModuleBuilder.java:117)
at org.apache.maven.lifecycle.internal.LifecycleModuleBuilder.buildProject (LifecycleModuleBuilder.java:81)
at org.apache.maven.lifecycle.internal.builder.singlethreaded.SingleThreadedBuilder.build (SingleThreadedBuilder.java:51)
at org.apache.maven.lifecycle.internal.LifecycleStarter.execute (LifecycleStarter.java:128)
at org.apache.maven.DefaultMaven.doExecute (DefaultMaven.java:309)
at org.apache.maven.DefaultMaven.doExecute (DefaultMaven.java:194)
at org.apache.maven.DefaultMaven.execute (DefaultMaven.java:107)
at org.apache.maven.cli.MavenCli.execute (MavenCli.java:955)
at org.apache.maven.cli.MavenCli.doMain (MavenCli.java:290)
at org.apache.maven.cli.MavenCli.main (MavenCli.java:194)
at sun.reflect.NativeMethodAccessorImpl.invoke0 (Native Method)
at sun.reflect.NativeMethodAccessorImpl.invoke (NativeMethodAccessorImpl.java:62)
at sun.reflect.DelegatingMethodAccessorImpl.invoke (DelegatingMethodAccessorImpl.java:43)
at java.lang.reflect.Method.invoke (Method.java:498)
at org.codehaus.plexus.classworlds.launcher.Launcher.launchEnhanced (Launcher.java:289)
at org.codehaus.plexus.classworlds.launcher.Launcher.launch (Launcher.java:229)
at org.codehaus.plexus.classworlds.launcher.Launcher.mainWithExitCode (Launcher.java:415)
at org.codehaus.plexus.classworlds.launcher.Launcher.main (Launcher.java:356)
Caused by: java.lang.UnsupportedOperationException
at org.objectweb.asm.ClassVisitor.visitModule (ClassVisitor.java:129)
at org.objectweb.asm.ClassReader.readModule (ClassReader.java:667)
at org.objectweb.asm.ClassReader.accept (ClassReader.java:503)
at org.objectweb.asm.ClassReader.accept (ClassReader.java:355)
at org.apache.xbean.finder.AbstractFinder.readClassDef (AbstractFinder.java:581)
at org.apache.xbean.finder.AbstractFinder.readClassDef (AbstractFinder.java:576)
at org.apache.xbean.finder.AbstractFinder.readClassDef (AbstractFinder.java:562)
at org.apache.xbean.finder.ClassFinder.<init> (ClassFinder.java:122)
at org.fusesource.hawtjni.generator.HawtJNI.findClasses (HawtJNI.java:296)
at org.fusesource.hawtjni.generator.HawtJNI.generate (HawtJNI.java:211)
at org.fusesource.hawtjni.maven.GenerateMojo.generateNativeSourceFiles (GenerateMojo.java:205)
at org.fusesource.hawtjni.maven.GenerateMojo.execute (GenerateMojo.java:172)
at org.apache.maven.plugin.DefaultBuildPluginManager.executeMojo (DefaultBuildPluginManager.java:134)
at org.apache.maven.lifecycle.internal.MojoExecutor.execute (MojoExecutor.java:208)
at org.apache.maven.lifecycle.internal.MojoExecutor.execute (MojoExecutor.java:154)
at org.apache.maven.lifecycle.internal.MojoExecutor.execute (MojoExecutor.java:146)
at org.apache.maven.lifecycle.internal.LifecycleModuleBuilder.buildProject (LifecycleModuleBuilder.java:117)
at org.apache.maven.lifecycle.internal.LifecycleModuleBuilder.buildProject (LifecycleModuleBuilder.java:81)
at org.apache.maven.lifecycle.internal.builder.singlethreaded.SingleThreadedBuilder.build (SingleThreadedBuilder.java:51)
at org.apache.maven.lifecycle.internal.LifecycleStarter.execute (LifecycleStarter.java:128)
at org.apache.maven.DefaultMaven.doExecute (DefaultMaven.java:309)
at org.apache.maven.DefaultMaven.doExecute (DefaultMaven.java:194)
at org.apache.maven.DefaultMaven.execute (DefaultMaven.java:107)
at org.apache.maven.cli.MavenCli.execute (MavenCli.java:955)
at org.apache.maven.cli.MavenCli.doMain (MavenCli.java:290)
at org.apache.maven.cli.MavenCli.main (MavenCli.java:194)
at sun.reflect.NativeMethodAccessorImpl.invoke0 (Native Method)
at sun.reflect.NativeMethodAccessorImpl.invoke (NativeMethodAccessorImpl.java:62)
at sun.reflect.DelegatingMethodAccessorImpl.invoke (DelegatingMethodAccessorImpl.java:43)
at java.lang.reflect.Method.invoke (Method.java:498)
at org.codehaus.plexus.classworlds.launcher.Launcher.launchEnhanced (Launcher.java:289)
at org.codehaus.plexus.classworlds.launcher.Launcher.launch (Launcher.java:229)
at org.codehaus.plexus.classworlds.launcher.Launcher.mainWithExitCode (Launcher.java:415)
at org.codehaus.plexus.classworlds.launcher.Launcher.main (Launcher.java:356)
[ERROR]
[ERROR]
[ERROR] For more information about the errors and possible solutions, please read the following articles:
[ERROR] [Help 1] http://cwiki.apache.org/conflu ... ption
[ERROR]
[ERROR] After correcting the problems, you can resume the build with the command
[ERROR] mvn <goals> -rf :leveldbjni
错误:/var/tmp/rpm-tmp.7aCjLM (%build) 退出状态不好


RPM 构建错误:
/var/tmp/rpm-tmp.7aCjLM (%build) 退出状态不好
<mock-chroot> sh-4.4#
已邀请:

要回复问题请先登录注册